Проблема с установкой freeradius+freenibs

Автор: lain Дата: 13.09.2006 09:32 ASP Linux 11
freeradius-1.0.4
freenibs-3.0.0-b3

при выполнение make возникает следующая ошибка

sal_postgresql.c:214: error: static declaration of 'pst_query' follows non-static declaration
sal_postgresql.c:62: error: previous declaration of 'pst_query' was here
gmake[10]: *** [sal_postgresql.o] Ошибка 1
gmake[10]: Leaving directory `/root/install/radius2/freeradius-1.0.4/src/modules/rlm_nibs/drivers/sal_postgresql'
gmake[9]: *** [common] Ошибка 1
gmake[9]: Leaving directory `/root/install/radius2/freeradius-1.0.4/src/modules/rlm_nibs/drivers'
gmake[8]: *** [static] Ошибка 2
gmake[8]: Leaving directory `/root/install/radius2/freeradius-1.0.4/src/modules/rlm_nibs/drivers'
gmake[7]: *** [common] Ошибка 1
gmake[7]: Leaving directory `/root/install/radius2/freeradius-1.0.4/src/modules/rlm_nibs'
gmake[6]: *** [static] Ошибка 2
gmake[6]: Leaving directory `/root/install/radius2/freeradius-1.0.4/src/modules/rlm_nibs'
gmake[5]: *** [common] Ошибка 2
gmake[5]: Leaving directory `/root/install/radius2/freeradius-1.0.4/src/modules'
gmake[4]: *** [all] Ошибка 2
gmake[4]: Leaving directory `/root/install/radius2/freeradius-1.0.4/src/modules'
gmake[3]: *** [common] Ошибка 2
gmake[3]: Leaving directory `/root/install/radius2/freeradius-1.0.4/src'
gmake[2]: *** [all] Ошибка 2
gmake[2]: Leaving directory `/root/install/radius2/freeradius-1.0.4/src'
gmake[1]: *** [common] Ошибка 2
gmake[1]: Leaving directory `/root/install/radius2/freeradius-1.0.4'
make: *** [all] Ошибка 2

что делать??
RSS-материал