Проблема при сборке khealthcare !!!

Автор: garik37 Дата: 11.04.2007 01:30 Добрый день!

При сборке khealthcare происходит ошибка

---

make all-recursive
make[1]: Entering directory `/usr/local/src/khealthcare-0.82'
Making all in khealthcare
make[2]: Entering directory `/usr/local/src/khealthcare-0.82/khealthcare'
g++ -DHAVE_CONFIG_H -I. -I. -I.. -I/usr/include -I/usr/lib/qt2/include -I/usr/X11R6/include -I/usr/local/include -O3 -fno-exceptions -fno-check-new -Wall -pedantic -W -Wpointer-arith -Wmissing-prototypes -Wwrite-strings -Wno-long-long -fno-builtin -fexceptions -c khspinbox.cpp
cc1plus: warning: command line option "-Wmissing-prototypes" is valid for Ada/C/ObjC but not for C++
In file included from khspinbox.cpp:20:
khspinbox.h:22:22: error: qspinbox.h: Нет такого файла или каталога
khspinbox.h:28: error: expected class-name before '{' token
khspinbox.h:30: error: 'QWidget' has not been declared
khspinbox.h:33: error: 'QString' does not name a type
khspinbox.cpp:22: error: 'QWidget' has not been declared
khspinbox.cpp: In constructor 'KHSpinBox::KHSpinBox(int, int, int, int*, const char*)':
khspinbox.cpp:23: error: class 'KHSpinBox' does not have any field named 'QSpinBox'
khspinbox.cpp: At global scope:
khspinbox.cpp:30: error: 'QString' does not name a type
khspinbox.cpp: In member function 'int KHSpinBox::mapTextToValue(bool*)':
khspinbox.cpp:37: error: 'text' was not declared in this scope
khspinbox.cpp: At global scope:
khspinbox.cpp:35: warning: unused parameter 'ok'
make[2]: *** [khspinbox.o] Ошибка 1
make[2]: Leaving directory `/usr/local/src/khealthcare-0.82/khealthcare'
make[1]: *** [all-recursive] Ошибка 1
make[1]: Leaving directory `/usr/local/src/khealthcare-0.82'
make: *** [all-recursive-am] Ошибка 2
---

как это исправить
Есть ли готовый рпм для установки
Re: Проблема при сборке khealthcare !!! 11.04.2007 17:12alex040269 > khspinbox.h:22:22: error: qspinbox.h: Нет такого файла или
> каталога

Похоже не хватает qt3
Re: Проблема при сборке khealthcare !!! 12.04.2007 00:08garik37 qt3 установлен
Я бы сразу увидел

Другие проекты же устанавливались
Re: Проблема при сборке khealthcare !!! 12.04.2007 10:52alex040269 нет опции компилятору -I /usr/lib/qt3/include. или куда у Вас установлен qt3?
RSS-материал